{"text_format":"1","workbook":"xlsx","n_sheets":5,"sheets":["Basic Instructions","Application Information","SNAP Counting Sheet","Recap","Parameters"],"not_rendered":{"charts":0,"images":3,"macros":1,"external_links":0,"defined_names":34,"comments":1,"pivot_tables":0},"unopened":[],"bounds":{"document_bytes":16777216,"sheet_cells":100000,"rows_first":2000,"rows_last":500,"rows_between":2000,"halvings":0,"cell_chars":16384,"cell_head_chars":4096},"cells_cut":0,"cells_raw":0,"read":"whole","date_system":"1900"}

{"sheet":"Basic Instructions","index":0,"n_rows":26,"n_cols":7,"rows_kept":26,"cut":false,"hidden":false,"merged":[[10,1,10,15],[11,1,11,15],[12,1,12,15],[13,1,13,15],[7,1,7,15],[9,1,9,15],[25,1,25,8],[15,1,15,15],[18,1,18,15],[19,1,19,15],[20,2,20,15],[16,1,16,15],[17,1,17,15],[14,1,14,15],[21,2,21,15],[22,2,22,15],[23,1,23,15],[24,1,24,15]]}
[]
[]
[]
[]
[]
[]
[null,null,null,null,null,"BASIC INSTRUCTIONS FOR SNAP COUNTERS"]
[null,"Please scroll down this worksheet to read all basic instructions.\nYou can modify this tool by writing to NFSSC@IFPUG.COM: \nIFPUG/NFSSC will provide you with the password to unprotect the spreadsheets. You are welcome to send your changes to IFPUG / NFSSC so that other users may benefit from your improvements."]
[null,null,null,null,null,"Mail to:","nfssc@ifpug.com"]
[1,"Collect SNAP points at the application boundary level, and report the work effort to build those SNAP points corresponding to the same application boundary.  This is the application boundary as defined under function points."]
{"$rows_left_out":17}
{"sheet":"Application Information","index":1,"n_rows":131,"n_cols":8,"rows_kept":131,"cut":false,"hidden":false,"merged":[[130,1,130,7],[83,1,83,2],[103,2,103,7],[109,2,109,5],[127,1,127,7],[37,4,37,6],[75,5,75,6],[80,1,80,2],[129,1,129,7],[43,1,44,1],[36,1,36,2],[12,1,12,7],[70,4,71,6],[47,2,47,4],[48,2,48,4],[56,1,56,7],[22,4,22,6],[28,4,28,6],[39,4,39,6],[62,1,62,7],[59,1,59,7],[32,4,32,6],[24,4,27,6],[29,7,31,7],[35,4,35,6],[36,4,36,6],[5,1,5,2],[72,1,72,2],[74,1,74,2],[74,5,74,6],[44,2,44,3],[23,1,23,2],[28,1,28,2],[41,4,41,6],[29,1,31,2],[32,1,32,2],[37,1,37,2],[33,1,33,2],[35,1,35,2],[33,4,33,6],[34,1,34,2],[34,4,34,6]]}
[]
[]
[]
[]
[null,"Name:"]
[]
[]
[]
[]
[]
{"$rows_left_out":122}
{"sheet":"SNAP Counting Sheet","index":2,"n_rows":54,"n_cols":67,"rows_kept":54,"cut":false,"hidden":false,"merged":[[3,39,6,39],[3,61,6,61],[4,54,4,55],[5,35,6,35],[3,35,3,37],[4,12,4,13],[4,15,4,17],[4,28,4,29],[3,54,3,55],[3,56,6,56],[3,15,3,17],[5,1,6,1],[3,0,6,0],[3,3,3,5],[3,6,6,6],[4,3,4,5],[5,4,6,4],[5,8,6,8],[2,54,2,62],[3,12,3,13],[3,18,6,18],[3,22,6,22],[3,23,6,23],[3,38,6,38],[5,20,6,20],[5,36,6,36],[4,31,4,33],[4,35,4,37],[3,53,6,53],[5,50,6,50],[5,51,6,51],[3,52,6,52],[2,3,2,23],[3,27,6,27],[3,28,3,29],[5,2,6,2],[5,3,6,3],[5,5,6,5],[5,21,6,21],[3,31,3,33],[5,31,6,31],[5,32,6,32],[5,25,6,25],[3,11,6,11],[5,16,6,16],[3,7,3,10],[4,7,4,10],[5,10,6,10],[3,30,6,30],[5,7,6,7],[5,9,6,9],[3,19,3,21],[4,19,4,21],[5,19,6,19],[5,12,6,12],[5,13,6,13],[5,15,6,15],[5,17,6,17],[3,14,6,14],[2,24,2,37],[3,24,3,26],[4,24,4,26],[5,24,6,24],[5,33,6,33],[5,37,6,37],[5,29,6,29],[5,26,6,26],[5,28,6,28],[3,34,6,34],[2,40,2,53],[3,44,3,47],[4,44,4,47],[5,44,6,44],[5,45,6,45],[3,49,3,51],[4,49,4,51],[5,49,6,49],[3,43,6,43],[5,41,6,41],[3,48,6,48],[5,42,6,42],[5,46,6,46],[5,47,6,47],[3,40,3,42],[4,40,4,42],[5,40,6,40],[52,24,52,26],[53,24,53,26],[52,28,52,30],[53,28,53,30],[52,31,52,33],[53,31,53,33],[52,35,52,37],[53,35,53,37],[52,40,52,42],[53,40,53,42],[52,3,52,5],[53,3,53,5],[52,7,52,10],[53,7,53,10],[52,12,52,13],[53,12,53,13],[52,15,52,17],[53,15,53,17],[52,19,52,21],[53,19,53,21],[52,44,52,47],[53,44,53,47],[52,49,52,51],[53,49,53,51],[52,53,52,55],[53,53,53,55],[52,57,52,60],[53,57,53,60],[3,63,6,63],[5,54,6,54],[5,55,6,55],[5,58,6,58],[5,59,6,59],[3,57,3,60],[4,57,4,60],[5,57,6,57],[5,60,6,60],[3,62,6,62]]}
["SNAP COUNTING WORKSHEET"]
[null,null,null,{"$f":"COLUMN()-2","v":2},{"$f":"COLUMN()-2","v":3},4,5,6,7,8,9,10,11,12,13,14,15,16,17,18,19,20,21,22,23,24,25,26,27,28,29,30,31,32,33,34,35,36,37,38,39,40,41,42,43,44,45,46,47,48,49,50,51,52,53,54,55,56,57,58,59,60,61,62]
[null,null,null,"Category 1:  Data Operations",null,null,null,null,null,null,null,null,null,null,null,null,null,null,null,null,null,null,null,null,"Category 2:  Interface Design",null,null,null,null,null,null,null,null,null,null,null,null,null,null,null,"Category 3:  Technical Environment",null,null,null,null,null,null,null,null,null,null,null,null,null,"Category 4:  Architecture"]
["No.",null,"Sub-Category: ","1.1  Data Entry Validation",null,null,"Data Entry Validation SNAP Count","1.2  Logical and Mathematical\nOperations",null,null,null,"Logical and Mathematical\nOperations SNAP Count","1.3  Data Formatting",null,"Data Formatting SNAP Count","1.4  Internal Data Movements",null,null,"Internal Data Movements SNAP Count","1.5  Delivering Added Value to Users by Data Configuration",null,null,"Delivering Functionality by Data Configuration SNAP Count","Data Operations Effort in Person-Hours","2.1  UI Changes",null,null,"UI Changes SNAP Count","2.2  Help Methods",null,"Help Methods SNAP Count","2.3  Multiple Input Methods",null,null,"Multiple Input Methods SNAP Count","2.4  Multiple Output Methods",null,null,"Multiple Output Methods SNAP Points","Interface Design Effort in Person-Hours","3.1  Multiple Platforms",null,null,"Multiple Platforms SNAP Points","3.2  Database Technology",null,null,null,"Database Technology SNAP Points","3.3  Batch Processes",null,null,"Batch Processes SNAP Points","Technical Environment Effort in Person-Hours","4.1  Component Based Software",null,"Component-based Software SNAP Points","4.2  Multiple Input / Output Interfaces",null,null,null,"Multiple Input / Output Interfaces SNAP Count","Architecture Effort in Person-Hours","Comments"]
[null,null,"SCU Definition: ","SCU=The Functional Elementary Process",null,null,null,"SCU=The Functional Elementary Process",null,null,null,null,"SCU=The Functional Elementary Process",null,null,"SCU=The Functional Elementary Process",null,null,null,"SCU=The Functional Elementary Process",null,null,null,null,"SCU=Set of screens as defined by the functional elementary process ",null,null,null,"SCU=The assessed application ",null,null,"SCU=The Functional Elementary Process",null,null,null,"SCU=The Functional Elementary Process",null,null,null,null,"SCU=The Functional Elementary Process",null,null,null,"SCU=The Functional Elementary Process",null,null,null,null,"SCU=The batch job",null,null,null,null,"SCU=The Functional Elementary Process",null,null,"SCU=The assessed application"]
[null,"SCU Action (Add, Change, Delete)","\nSCU Description / ID     ","Number of nesting levels","Complexity Level","Number of DETs",null,"Elementary Process Type (Main Purpose)","Number of DETs","Number of FTR","Complexity Level",null,"Transformation Complexity Level (L, A, H)","Number of DETs",null,"Number of FTRs","Complexity Level","Number of DETs",null,"Number of Records","Complexity Level","Number of Attributes",null,null,"Number of Properties (the sum of the number of unique properties) added or configured","Complexity Level","Number of Unique UI Elements",null,"Screenshot(s)  added?","Number of Items Impacted",null,"Number of DETs","Complexity Level","Number of Input Methods",null,"Number of DETs","Complexity Level","Number of Output Methods",null,null,"Nature of Platforms (Software / Hardware)","Numbers of Platforms to Operate","Platform Type:  Same family, Different family, Real time,                Non-real time",null,"Number of DETs","Number of RETs","Complexity Level","Number of Changes",null,"Number of FTRs","Complexity Level (L, A, H)","Number of DETs",null,null,"Number of Unique In-house Components","Number of Unique Third Party Components",null,"Number of DETs","Complexity Level","Total # of Input Interfaces","Total # of Output Interfaces"]
[]
[{"$f":"ROW()-7","v":1},"ADD","Example (erase when starting the count)","3 to 5",{"$f":"IF(D8=\"\",\"\",(IF(D8=\"1 to 2\",\"Low\",IF(D8=\"3 to 5\",\"Average\",\"High\"))))","v":"Average"},4,{"$f":"IF(OR(E8=\"\",NOT(ISNUMBER(F8))),\"\",IF(E8=\"Low\",F8*2,IF(E8=\"Average\",F8*3,IF(E8=\"High\",F8*4))))","v":12},"Logical",3,"0 to 3",{"$f":"IF(J8=\"\",\"\",IF(J8=\"0 to 3\",\"Low\",IF(J8=\"4 to 9\",\"Average\",\"High\")))","v":"Low"},{"$f":"IF(OR(H8=\"\",K8=\"\",NOT(ISNUMBER(I8))),\"\",IF(H8=\"Logical\",IF(K8=\"Low\",4*I8,IF(K8=\"Average\",6*I8,IF(K8=\"High\",10*I8))),IF(H8=\"Mathematical\",IF(K8=\"Low\",3*I8,IF(K8=\"Average\",4*I8,IF(K8=\"High\",7*I8,\"Error\"))))))","v":12},"Low",4,{"$f":"IF(OR(M8=\"\",N8=\"\",NOT(ISNUMBER(N8))),\"\",IF(M8=\"Low\",N8*2,IF(M8=\"Average\",N8*3,IF(M8=\"High\",N8*5))))","v":8},"10+",{"$f":"IF(P8=\"\",\"\",IF(P8=\"1 to 3\",\"Low\",IF(P8=\"4 to 9\",\"Average\",\"High\")))","v":"High"},8,{"$f":"IF(OR(R8=\"\",NOT(ISNUMBER(R8))),\"\",IF(P8=\"\",\"\",IF(Q8=\"Low\",R8*4,IF(Q8=\"Average\",R8*6,IF(Q8=\"High\",R8*10)))))","v":80},"30+",{"$f":"IF(T8=\"\",\"\",IF(T8=\"1 to 10\",\"Low\",IF(T8=\"11 to 29\",\"Average\",\"High\")))","v":"High"},5,{"$f":"IF(OR(T8=\"\",V8=\"\",NOT(ISNUMBER(V8))),\"\",IF(U8=\"Low\",V8*6,IF(U8=\"Average\",V8*8,IF(U8=\"High\",V8*12))))","v":60},null,"10 to 15",{"$f":"IF(Y8=\"\",\"\",IF(Y8=\"1 to 9\",\"Low\",IF(Y8=\"10 to 15\",\"Average\",\"High\")))","v":"Average"},7,{"$f":"IF(OR(Z8=\"\",NOT(ISNUMBER(AA8))),\"\",IF(Z8=\"Low\",AA8*2,IF(Z8=\"Average\",AA8*3,IF(Z8=\"High\",AA8*4))))","v":21},"Yes",25,{"$f":"IFERROR(ROUND(IF(AC8=\"No\",AD8/16,IF(AC8=\"yes\",(2+(AD8/16)),\"\")),1),\"\")","v":3.6},"16+",{"$f":"IF(AF8=\"\",\"\",IF(AF8=\"1 to 4\",\"Low\",IF(AF8=\"5 to 15\",\"Average\",\"High\")))","v":"High"},6,{"$f":"IF(OR(AG8=\"\",NOT(ISNUMBER(AH8))),\"\",IF(AG8=\"Low\",AH8*3,IF(AG8=\"Average\",AH8*4,IF(AG8=\"High\",AH8*6))))","v":36},"6 to 19",{"$f":"IF(AJ8=\"\",\"\",IF(AJ8=\"1 to 5\",\"Low\",IF(AJ8=\"6 to 19\",\"Average\",\"High\")))","v":"Average"},2,{"$f":"IF(OR(AK8=\"\",NOT(ISNUMBER(AL8))),\"\",IF(AK8=\"Low\",AL8*3,IF(AK8=\"Average\",AL8*4,IF(AK8=\"High\",AL8*6))))","v":8},234,"Software Platform",3,"Different family",{"$f":"IF(BN8=\"\",\"\",IF(BN8=\"BA\",\"TBD\",IF(BN8=\"AA\",IF(AP8=2,20,IF(AP8=3,30,IF(AP8>3,40))),IF(BN8=\"AB\",IF(AP8=2,40,IF(AP8=3,60,IF(AP8>3,80))),IF(BN8=\"AC\",IF(AP8=2,10,IF(AP8=3,20,IF(AP8>3,30))))))))","v":60},"51+",1,{"$f":"IF(OR(AS8=\"\",AT8=\"\"),\"\",VLOOKUP(BO8,Parameters!$B$75:$C$83,2,FALSE))","v":"Average"},5,{"$f":"IF(AU8=\"\",\"\",IF(AU8=\"Low\",AV8*6,IF(AU8=\"Average\",AV8*9,IF(AU8=\"High\",AV8*12))))","v":45},"1 to 3",{"$f":"IF(AX8=\"\",\"\",IF(AX8=\"1 to 3\",\"Low\",IF(AX8=\"4 to 9\",\"Average\",\"High\")))","v":"Low"},1,{"$f":"IF(OR(AX8=\"\",NOT(ISNUMBER(AZ8))),\"\",IF(AY8=\"Low\",AZ8*4,IF(AY8=\"Average\",AZ8*6,IF(AY8=\"High\",AZ8*10))))","v":4},23,5,4,{"$f":"IF(AND(NOT(ISNUMBER(BD8)),NOT(ISNUMBER(BC8))),\"\",(BC8*3+BD8*4))","v":31},"6 to 19",{"$f":"IF(BF8=\"\",\"\",IF(BF8=\"1 to 5\",\"Low\",IF(BF8=\"6 to 19\",\"Average\",\"High\")))","v":"Average"},2,3,{"$f":"IF(OR(BF8=\"\",(BH8+BI8)=0,NOT(ISNUMBER(BI8)),NOT(ISNUMBER(BH8))),\"\",IF(BG8=\"Low\",(BH8+BI8)*3,IF(BG8=\"Average\",(BH8+BI8)*4,IF(BG8=\"High\",(BH8+BI8)*6))))","v":20},78,null,null,{"$f":"IF(AO8=\"\",\"\",IF(AO8=\"Software Platform\",IF(AQ8=\"Same family\",\"AA\",IF(AQ8=\"Different Family\",\"AB\",\"AC\")),IF(AO8=\"Hardware Platform\",\"BA\")))","v":"AB"},{"$f":"AT8&AS8","v":"151+"}]
[{"$f":"ROW()-7","v":2},"ADD",null,null,{"$f":"IF(D9=\"\",\"\",(IF(D9=\"1 to 2\",\"Low\",IF(D9=\"3 to 5\",\"Average\",\"High\"))))","v":""},null,{"$f":"IF(OR(E9=\"\",NOT(ISNUMBER(F9))),\"\",IF(E9=\"Low\",F9*2,IF(E9=\"Average\",F9*3,IF(E9=\"High\",F9*4))))","v":""},null,null,null,{"$f":"IF(J9=\"\",\"\",IF(J9=\"0 to 3\",\"Low\",IF(J9=\"4 to 9\",\"Average\",\"High\")))","v":""},{"$f":"IF(OR(H9=\"\",K9=\"\",NOT(ISNUMBER(I9))),\"\",IF(H9=\"Logical\",IF(K9=\"Low\",4*I9,IF(K9=\"Average\",6*I9,IF(K9=\"High\",10*I9))),IF(H9=\"Mathematical\",IF(K9=\"Low\",3*I9,IF(K9=\"Average\",4*I9,IF(K9=\"High\",7*I9,\"Error\"))))))","v":""},null,null,{"$f":"IF(OR(M9=\"\",N9=\"\",NOT(ISNUMBER(N9))),\"\",IF(M9=\"Low\",N9*2,IF(M9=\"Average\",N9*3,IF(M9=\"High\",N9*5))))","v":""},null,{"$f":"IF(P9=\"\",\"\",IF(P9=\"1 to 3\",\"Low\",IF(P9=\"4 to 9\",\"Average\",\"High\")))","v":""},null,{"$f":"IF(OR(R9=\"\",NOT(ISNUMBER(R9))),\"\",IF(P9=\"\",\"\",IF(Q9=\"Low\",R9*4,IF(Q9=\"Average\",R9*6,IF(Q9=\"High\",R9*10)))))","v":""},null,{"$f":"IF(T9=\"\",\"\",IF(T9=\"1 to 10\",\"Low\",IF(T9=\"11 to 29\",\"Average\",\"High\")))","v":""},null,{"$f":"IF(OR(T9=\"\",V9=\"\",NOT(ISNUMBER(V9))),\"\",IF(U9=\"Low\",V9*6,IF(U9=\"Average\",V9*8,IF(U9=\"High\",V9*12))))","v":""},null,null,{"$f":"IF(Y9=\"\",\"\",IF(Y9=\"1 to 9\",\"Low\",IF(Y9=\"10 to 15\",\"Average\",\"High\")))","v":""},null,{"$f":"IF(OR(Z9=\"\",NOT(ISNUMBER(AA9))),\"\",IF(Z9=\"Low\",AA9*2,IF(Z9=\"Average\",AA9*3,IF(Z9=\"High\",AA9*4))))","v":""},null,null,{"$f":"IFERROR(ROUND(IF(AC9=\"No\",AD9/16,IF(AC9=\"yes\",(2+(AD9/16)),\"\")),1),\"\")","v":""},null,{"$f":"IF(AF9=\"\",\"\",IF(AF9=\"1 to 4\",\"Low\",IF(AF9=\"5 to 15\",\"Average\",\"High\")))","v":""},6,{"$f":"IF(OR(AG9=\"\",NOT(ISNUMBER(AH9))),\"\",IF(AG9=\"Low\",AH9*3,IF(AG9=\"Average\",AH9*4,IF(AG9=\"High\",AH9*6))))","v":""},null,{"$f":"IF(AJ9=\"\",\"\",IF(AJ9=\"1 to 5\",\"Low\",IF(AJ9=\"6 to 19\",\"Average\",\"High\")))","v":""},null,{"$f":"IF(OR(AK9=\"\",NOT(ISNUMBER(AL9))),\"\",IF(AK9=\"Low\",AL9*3,IF(AK9=\"Average\",AL9*4,IF(AK9=\"High\",AL9*6))))","v":""},null,null,null,null,{"$f":"IF(BN9=\"\",\"\",IF(BN9=\"BA\",\"TBD\",IF(BN9=\"AA\",IF(AP9=2,20,IF(AP9=3,30,IF(AP9>3,40))),IF(BN9=\"AB\",IF(AP9=2,40,IF(AP9=3,60,IF(AP9>3,80))),IF(BN9=\"AC\",IF(AP9=2,10,IF(AP9=3,20,IF(AP9>3,30))))))))","v":""},null,null,{"$f":"IF(OR(AS9=\"\",AT9=\"\"),\"\",VLOOKUP(BO9,Parameters!$B$75:$C$83,2,FALSE))","v":""},null,{"$f":"IF(AU9=\"\",\"\",IF(AU9=\"Low\",AV9*6,IF(AU9=\"Average\",AV9*9,IF(AU9=\"High\",AV9*12))))","v":""},"4 to 9",{"$f":"IF(AX9=\"\",\"\",IF(AX9=\"1 to 3\",\"Low\",IF(AX9=\"4 to 9\",\"Average\",\"High\")))","v":"Average"},null,{"$f":"IF(OR(AX9=\"\",NOT(ISNUMBER(AZ9))),\"\",IF(AY9=\"Low\",AZ9*4,IF(AY9=\"Average\",AZ9*6,IF(AY9=\"High\",AZ9*10))))","v":""},null,null,null,{"$f":"IF(AND(NOT(ISNUMBER(BD9)),NOT(ISNUMBER(BC9))),\"\",(BC9*3+BD9*4))","v":""},"1 to 5",{"$f":"IF(BF9=\"\",\"\",IF(BF9=\"1 to 5\",\"Low\",IF(BF9=\"6 to 19\",\"Average\",\"High\")))","v":"Low"},null,null,{"$f":"IF(OR(BF9=\"\",(BH9+BI9)=0,NOT(ISNUMBER(BI9)),NOT(ISNUMBER(BH9))),\"\",IF(BG9=\"Low\",(BH9+BI9)*3,IF(BG9=\"Average\",(BH9+BI9)*4,IF(BG9=\"High\",(BH9+BI9)*6))))","v":""},null,null,null,{"$f":"IF(AO9=\"\",\"\",IF(AO9=\"Software Platform\",IF(AQ9=\"Same family\",\"AA\",IF(AQ9=\"Different Family\",\"AB\",\"AC\")),IF(AO9=\"Hardware Platform\",\"BA\")))","v":""},{"$f":"AT9&AS9","v":""}]
[{"$f":"ROW()-7","v":3},"ADD",null,null,{"$f":"IF(D10=\"\",\"\",(IF(D10=\"1 to 2\",\"Low\",IF(D10=\"3 to 5\",\"Average\",\"High\"))))","v":""},null,{"$f":"IF(OR(E10=\"\",NOT(ISNUMBER(F10))),\"\",IF(E10=\"Low\",F10*2,IF(E10=\"Average\",F10*3,IF(E10=\"High\",F10*4))))","v":""},null,null,null,{"$f":"IF(J10=\"\",\"\",IF(J10=\"0 to 3\",\"Low\",IF(J10=\"4 to 9\",\"Average\",\"High\")))","v":""},{"$f":"IF(OR(H10=\"\",K10=\"\",NOT(ISNUMBER(I10))),\"\",IF(H10=\"Logical\",IF(K10=\"Low\",4*I10,IF(K10=\"Average\",6*I10,IF(K10=\"High\",10*I10))),IF(H10=\"Mathematical\",IF(K10=\"Low\",3*I10,IF(K10=\"Average\",4*I10,IF(K10=\"High\",7*I10,\"Error\"))))))","v":""},null,null,{"$f":"IF(OR(M10=\"\",N10=\"\",NOT(ISNUMBER(N10))),\"\",IF(M10=\"Low\",N10*2,IF(M10=\"Average\",N10*3,IF(M10=\"High\",N10*5))))","v":""},null,{"$f":"IF(P10=\"\",\"\",IF(P10=\"1 to 3\",\"Low\",IF(P10=\"4 to 9\",\"Average\",\"High\")))","v":""},null,{"$f":"IF(OR(R10=\"\",NOT(ISNUMBER(R10))),\"\",IF(P10=\"\",\"\",IF(Q10=\"Low\",R10*4,IF(Q10=\"Average\",R10*6,IF(Q10=\"High\",R10*10)))))","v":""},null,"",null,{"$f":"IF(OR(T10=\"\",V10=\"\",NOT(ISNUMBER(V10))),\"\",IF(U10=\"Low\",V10*6,IF(U10=\"Average\",V10*8,IF(U10=\"High\",V10*12))))","v":""},null,null,{"$f":"IF(Y10=\"\",\"\",IF(Y10=\"1 to 9\",\"Low\",IF(Y10=\"10 to 15\",\"Average\",\"High\")))","v":""},null,{"$f":"IF(OR(Z10=\"\",NOT(ISNUMBER(AA10))),\"\",IF(Z10=\"Low\",AA10*2,IF(Z10=\"Average\",AA10*3,IF(Z10=\"High\",AA10*4))))","v":""},null,null,{"$f":"IFERROR(ROUND(IF(AC10=\"No\",AD10/16,IF(AC10=\"yes\",(2+(AD10/16)),\"\")),1),\"\")","v":""},null,{"$f":"IF(AF10=\"\",\"\",IF(AF10=\"1 to 4\",\"Low\",IF(AF10=\"5 to 15\",\"Average\",\"High\")))","v":""},null,{"$f":"IF(OR(AG10=\"\",NOT(ISNUMBER(AH10))),\"\",IF(AG10=\"Low\",AH10*3,IF(AG10=\"Average\",AH10*4,IF(AG10=\"High\",AH10*6))))","v":""},null,{"$f":"IF(AJ10=\"\",\"\",IF(AJ10=\"1 to 5\",\"Low\",IF(AJ10=\"6 to 19\",\"Average\",\"High\")))","v":""},null,{"$f":"IF(OR(AK10=\"\",NOT(ISNUMBER(AL10))),\"\",IF(AK10=\"Low\",AL10*3,IF(AK10=\"Average\",AL10*4,IF(AK10=\"High\",AL10*6))))","v":""},null,null,null,null,{"$f":"IF(BN10=\"\",\"\",IF(BN10=\"BA\",\"TBD\",IF(BN10=\"AA\",IF(AP10=2,20,IF(AP10=3,30,IF(AP10>3,40))),IF(BN10=\"AB\",IF(AP10=2,40,IF(AP10=3,60,IF(AP10>3,80))),IF(BN10=\"AC\",IF(AP10=2,10,IF(AP10=3,20,IF(AP10>3,30))))))))","v":""},null,null,{"$f":"IF(OR(AS10=\"\",AT10=\"\"),\"\",VLOOKUP(BO10,Parameters!$B$75:$C$83,2,FALSE))","v":""},null,{"$f":"IF(AU10=\"\",\"\",IF(AU10=\"Low\",AV10*6,IF(AU10=\"Average\",AV10*9,IF(AU10=\"High\",AV10*12))))","v":""},null,{"$f":"IF(AX10=\"\",\"\",IF(AX10=\"1 to 3\",\"Low\",IF(AX10=\"4 to 9\",\"Average\",\"High\")))","v":""},null,{"$f":"IF(OR(AX10=\"\",NOT(ISNUMBER(AZ10))),\"\",IF(AY10=\"Low\",AZ10*4,IF(AY10=\"Average\",AZ10*6,IF(AY10=\"High\",AZ10*10))))","v":""},null,null,null,{"$f":"IF(AND(NOT(ISNUMBER(BD10)),NOT(ISNUMBER(BC10))),\"\",(BC10*3+BD10*4))","v":""},"20+",{"$f":"IF(BF10=\"\",\"\",IF(BF10=\"1 to 5\",\"Low\",IF(BF10=\"6 to 19\",\"Average\",\"High\")))","v":"High"},null,null,{"$f":"IF(OR(BF10=\"\",(BH10+BI10)=0,NOT(ISNUMBER(BI10)),NOT(ISNUMBER(BH10))),\"\",IF(BG10=\"Low\",(BH10+BI10)*3,IF(BG10=\"Average\",(BH10+BI10)*4,IF(BG10=\"High\",(BH10+BI10)*6))))","v":""},null,null,null,{"$f":"IF(AO10=\"\",\"\",IF(AO10=\"Software Platform\",IF(AQ10=\"Same family\",\"AA\",IF(AQ10=\"Different Family\",\"AB\",\"AC\")),IF(AO10=\"Hardware Platform\",\"BA\")))","v":""},{"$f":"AT10&AS10","v":""}]
{"$rows_left_out":45}
{"sheet":"Recap","index":3,"n_rows":28,"n_cols":7,"rows_kept":28,"cut":false,"hidden":false,"merged":[[2,2,2,5]]}
["RECAP"]
[]
[null,null,"SNAP Count"]
["SNAP Category and Subcategory Recap",null,"Total","Add","Change","Delete","Effort in Person-Hours"]
["Category 1.  Data Operations",null,null,null,null,null,{"$f":"'SNAP Counting Sheet'!X49","v":0}]
[1.1000000000000001,"Data Entry Validation",{"$f":"'SNAP Counting Sheet'!G49","v":12},{"$f":"'SNAP Counting Sheet'!G50","v":12},{"$f":"'SNAP Counting Sheet'!G51","v":0},{"$f":"'SNAP Counting Sheet'!G52","v":0}]
[1.2,"Logical and Mathematical Operations",{"$f":"'SNAP Counting Sheet'!L49","v":12},{"$f":"'SNAP Counting Sheet'!L50","v":12},{"$f":"'SNAP Counting Sheet'!L51","v":0},{"$f":"'SNAP Counting Sheet'!L52","v":0}]
[1.3,"Data Formatting",{"$f":"'SNAP Counting Sheet'!O49","v":8},{"$f":"'SNAP Counting Sheet'!O50","v":8},{"$f":"'SNAP Counting Sheet'!O51","v":0},{"$f":"'SNAP Counting Sheet'!O52","v":0}]
[1.4,"Internal Data Movements",{"$f":"'SNAP Counting Sheet'!S49","v":80},{"$f":"'SNAP Counting Sheet'!S50","v":80},{"$f":"'SNAP Counting Sheet'!S51","v":0},{"$f":"'SNAP Counting Sheet'!S52","v":0}]
[1.5,"Delivering Added Value to Users by Data Configuration",{"$f":"'SNAP Counting Sheet'!W49","v":60},{"$f":"'SNAP Counting Sheet'!W50","v":60},{"$f":"'SNAP Counting Sheet'!W51","v":0},{"$f":"'SNAP Counting Sheet'!W52","v":0}]
{"$rows_left_out":19}
{"sheet":"Parameters","index":4,"n_rows":100,"n_cols":15,"rows_kept":100,"cut":false,"hidden":false,"merged":[[68,3,68,5],[70,1,72,1]]}
[]
[]
[null,null,"Hours",null,"Effort",null,"Help type",null,"Platform type",null,"Data Replication"]
[null,"man*hours",1,null,"Estimated",null,"Yes",null,"Software Platform",null,"1. No replication of data"]
[null,"man*days",{"$f":"C4*9","v":9},null,"Planned",null,"No",null,"Hardware Platform",null,"2. Replication of data should happen at runtime at the same time"]
[null,"man*weeks",{"$f":"C5*5","v":45},null,"Actual",null,null,null,null,null,"3. Replication of data can happen offline in batch mode"]
[null,"man*months",180,null,"ROM",null,null,null,null,null,"4. Replication of data will be handled automatically by the database"]
[]
[]
[null,null,null,null,null,null,null,null,"Architecture"]
{"$rows_left_out":90}